Reaction Details
TargetSomatostatin receptor type 3
LigandBDBM50091554
Substrate/Competitorn/a
Meas. Tech.ChEMBL_1498162 (CHEMBL3583382)
IC50 539±n/a nM
Citation Shah, SKHe, SGuo, LTruong, QQi, HDu, WLai, ZLiu, JJian, THong, QDobbelaar, PYe, ZSherer, EFeng, ZYu, YWong, FSamuel, KMadiera, MKaranam, BVReddy, VBMitelman, STong, SXChicchi, GGTsao, KLTrusca, DFeng, YWu, MShao, QTrujillo, MEEiermann, GJLi, CPachanski, MFernandez, GNelson, DBunting, PMorissette, PVolksdorf, SKerr, JZhang, BBHoward, ADZhou, YPPasternak, ANargund, RPHagmann, WK Discovery of MK-1421, a Potent, Selective sstr3 Antagonist, as a Development Candidate for Type 2 Diabetes. ACS Med Chem Lett6:513-7 (2015) 
 
Somatostatin receptor type 3
Name:Somatostatin receptor type 3
Type:Protein
Mol. Mass.:45855.97
Organism:Homo sapiens (Human)
Description:P32745
Residue:418
BDBM50091554
NameBDBM50091554
Synonyms:CHEMBL3582308
TypeSmall organic molecule
Emp. Form.C21H18FN3
Mol. Mass.331.3861
SMILESFc1ccc(cc1)-c1c[nH]c(n1)[C@@H]1CCc2[nH]c3ccccc3c2C1