Reaction Details
TargetSomatostatin receptor type 3
LigandBDBM50091507
Substrate/Competitorn/a
Meas. Tech.ChEMBL_1498162 (CHEMBL3583382)
IC50 0.500000±n/a nM
Citation Shah, SKHe, SGuo, LTruong, QQi, HDu, WLai, ZLiu, JJian, THong, QDobbelaar, PYe, ZSherer, EFeng, ZYu, YWong, FSamuel, KMadiera, MKaranam, BVReddy, VBMitelman, STong, SXChicchi, GGTsao, KLTrusca, DFeng, YWu, MShao, QTrujillo, MEEiermann, GJLi, CPachanski, MFernandez, GNelson, DBunting, PMorissette, PVolksdorf, SKerr, JZhang, BBHoward, ADZhou, YPPasternak, ANargund, RPHagmann, WK Discovery of MK-1421, a Potent, Selective sstr3 Antagonist, as a Development Candidate for Type 2 Diabetes. ACS Med Chem Lett6:513-7 (2015) 
 
Somatostatin receptor type 3
Name:Somatostatin receptor type 3
Type:Protein
Mol. Mass.:45855.97
Organism:Homo sapiens (Human)
Description:P32745
Residue:418
BDBM50091507
NameBDBM50091507
Synonyms:CHEMBL3582342
TypeSmall organic molecule
Emp. Form.C30H31FN10O2
Mol. Mass.582.6313
SMILESCCn1cc(cn1)[C@]1(N[C@H](Cc2c1[nH]c1ccccc21)c1nc(c[nH]1)-c1ccc(F)cn1)c1nn(CCN(C)C)c(=O)o1