Reaction Details
TargetPhosphatidylinositol 4,5-bisphosphate 3-kinase catalytic subunit alpha isoform
LigandBDBM50091701
Substrate/Competitorn/a
Meas. Tech.ChEMBL_1498376 (CHEMBL3584205)
IC50>25000±n/a nM
Citation Yang, HMedeiros, PFRaha, KElkins, PLind, KELehr, RAdams, NDBurgess, JLSchmidt, SJKnight, SDAuger, KRSchaber, MDFranklin, GJDing, YDeLorey, JLCentrella, PAMataruse, SSkinner, SRClark, MACuozzo, JWEvindar, G Discovery of a Potent Class of PI3Ka Inhibitors with Unique Binding Mode via Encoded Library Technology (ELT). ACS Med Chem Lett6:531-6 (2015) 
 
Phosphatidylinositol 4,5-bisphosphate 3-kinase catalytic subunit alpha isoform
Name:Phosphatidylinositol 4,5-bisphosphate 3-kinase catalytic subunit alpha isoform
Type:Enzyme Subunit
Mol. Mass.:124294.87
Organism:Homo sapiens (Human)
Description:P42336
Residue:1068
BDBM50091701
NameBDBM50091701
Synonyms:CHEMBL3582352
TypeSmall organic molecule
Emp. Form.C18H17IN4O4S2
Mol. Mass.544.386
SMILESCOC(=O)c1cc(I)cc(CNc2ccc(cc2)S(=O)(=O)Nc2nnc(C)s2)c1