Reaction Details
TargetPhosphatidylinositol 4,5-bisphosphate 3-kinase catalytic subunit beta isoform
LigandBDBM50091695
Substrate/Competitorn/a
Meas. Tech.ChEMBL_1498378 (CHEMBL3584207)
IC50 700±n/a nM
Citation Yang, HMedeiros, PFRaha, KElkins, PLind, KELehr, RAdams, NDBurgess, JLSchmidt, SJKnight, SDAuger, KRSchaber, MDFranklin, GJDing, YDeLorey, JLCentrella, PAMataruse, SSkinner, SRClark, MACuozzo, JWEvindar, G Discovery of a Potent Class of PI3Ka Inhibitors with Unique Binding Mode via Encoded Library Technology (ELT). ACS Med Chem Lett6:531-6 (2015) 
 
Phosphatidylinositol 4,5-bisphosphate 3-kinase catalytic subunit beta isoform
Name:Phosphatidylinositol 4,5-bisphosphate 3-kinase catalytic subunit beta isoform
Type:Enzyme Subunit
Mol. Mass.:122769.00
Organism:Homo sapiens (Human)
Description:P42338
Residue:1070
BDBM50091695
NameBDBM50091695
Synonyms:CHEMBL3582350
TypeSmall organic molecule
Emp. Form.C31H29FN6O4S2
Mol. Mass.632.728
SMILESCOc1ccc(cn1)-c1cc(CNc2ccc(cc2)S(=O)(=O)Nc2nnc(C)s2)cc(c1)C(=O)NCCc1ccccc1F