Reaction Details
TargetSerine/threonine-protein kinase B-raf
LigandBDBM50396483
Substrate/Competitorn/a
Meas. Tech.ChEMBL_1498391 (CHEMBL3584220)
IC50 33±n/a nM
Citation Li, YCheng, HZhang, ZZhuang, XLuo, JLong, HZhou, YXu, YTaghipouran, RLi, DPatterson, ASmaill, JTu, ZWu, DRen, XDing, K N-(3-Ethynyl-2,4-difluorophenyl)sulfonamide Derivatives as Selective Raf Inhibitors. ACS Med Chem Lett6:543-7 (2015) 
 
Serine/threonine-protein kinase B-raf
Name:Serine/threonine-protein kinase B-raf
Type:Serine/threonine-protein kinase
Mol. Mass.:84446.00
Organism:Homo sapiens (Human)
Description:P15056
Residue:766
BDBM50396483
NameBDBM50396483
Synonyms:PLX-4032 Ro 5185426 US11332479, Compound Vemurafenib US9388165, Reference, Vemurafenib (PLX-4032) VEMURAFENIB
TypeSmall organic molecule
Emp. Form.C23H18ClF2N3O3S
Mol. Mass.489.922
SMILESCCCS(=O)(=O)Nc1ccc(F)c(C(=O)c2c[nH]c3ncc(cc23)-c2ccc(Cl)cc2)c1F