Reaction Details
TargetMonocarboxylate transporter 1
LigandBDBM50092018
Substrate/Competitorn/a
Meas. Tech.ChEMBL_1498543 (CHEMBL3584796)
IC50 100±n/a nM
Citation Gurrapu, SJonnalagadda, SKAlam, MANelson, GLSneve, MGDrewes, LRMereddy, VR Monocarboxylate transporter 1 inhibitors as potential anticancer agents. ACS Med Chem Lett6:558-61 (2015) 
 
Monocarboxylate transporter 1
Name:Monocarboxylate transporter 1
Type:Enzyme
Mol. Mass.:53245.17
Organism:Rattus norvegicus (Rat)
Description:P53987
Residue:494
BDBM50092018
NameBDBM50092018
Synonyms:CHEMBL3582410 | US9296728, 9
TypeSmall organic molecule
Emp. Form.C18H24N2O2
Mol. Mass.300.3954
SMILESCC(C)CN(CC(C)C)c1ccc(\C=C(/C#N)C(O)=O)cc1