Reaction Details
TargetMonocarboxylate transporter 1
LigandBDBM50092069
Substrate/Competitorn/a
Meas. Tech.ChEMBL_1498543 (CHEMBL3584796)
IC50 8.0±n/a nM
Citation Gurrapu, SJonnalagadda, SKAlam, MANelson, GLSneve, MGDrewes, LRMereddy, VR Monocarboxylate transporter 1 inhibitors as potential anticancer agents. ACS Med Chem Lett6:558-61 (2015) 
 
Monocarboxylate transporter 1
Name:Monocarboxylate transporter 1
Type:Enzyme
Mol. Mass.:53245.17
Organism:Rattus norvegicus (Rat)
Description:P53987
Residue:494
BDBM50092069
NameBDBM50092069
Synonyms:CHEMBL3582422 | US9296728, 20
TypeSmall organic molecule
Emp. Form.C23H18N2O3
Mol. Mass.370.4006
SMILESCOc1cc(ccc1\C=C(/C#N)C(O)=O)N(c1ccccc1)c1ccccc1