Reaction Details
TargetMonocarboxylate transporter 1
LigandBDBM50092077
Substrate/Competitorn/a
Meas. Tech.ChEMBL_1498543 (CHEMBL3584796)
IC50 400±n/a nM
Citation Gurrapu, SJonnalagadda, SKAlam, MANelson, GLSneve, MGDrewes, LRMereddy, VR Monocarboxylate transporter 1 inhibitors as potential anticancer agents. ACS Med Chem Lett6:558-61 (2015) 
 
Monocarboxylate transporter 1
Name:Monocarboxylate transporter 1
Type:Enzyme
Mol. Mass.:53245.17
Organism:Rattus norvegicus (Rat)
Description:P53987
Residue:494
BDBM50092077
NameBDBM50092077
Synonyms:CHEMBL3582414 | US9296728, 8
TypeSmall organic molecule
Emp. Form.C16H12N2O2
Mol. Mass.264.2787
SMILESOC(=O)C(=C\c1ccc(cc1)N(CC#C)CC#C)\C#N