Reaction Details
TargetHigh affinity nerve growth factor receptor
LigandBDBM50092102
Substrate/Competitorn/a
Meas. Tech.ChEMBL_1498685 (CHEMBL3582854)
IC50 76±n/a nM
Citation Choi, HSRucker, PVWang, ZFan, YAlbaugh, PChopiuk, GGessier, FSun, FAdrian, FLiu, GHood, TLi, NJia, YChe, JMcCormack, SLi, ALi, JSteffy, ACulazzo, ATompkins, CPhung, VKreusch, ALu, MHu, BChaudhary, APrashad, MTuntland, TLiu, BHarris, JSeidel, HMLoren, JMolteni, V (R)-2-Phenylpyrrolidine Substituted Imidazopyridazines: A New Class of Potent and Selective Pan-TRK Inhibitors. ACS Med Chem Lett6:562-7 (2015) 
 
High affinity nerve growth factor receptor
Name:High affinity nerve growth factor receptor
Type:n/a
Mol. Mass.:87498.18
Organism:Homo sapiens (Human)
Description:P04629
Residue:796
BDBM50092102
NameBDBM50092102
Synonyms:CHEMBL3582431
TypeSmall organic molecule
Emp. Form.C20H17FN4O
Mol. Mass.348.3736
SMILESOCc1ccc(cc1)-c1cnc2ccc(NCc3cccc(F)c3)nn12