Reaction Details
TargetNT-3 growth factor receptor
LigandBDBM50092081
Substrate/Competitorn/a
Meas. Tech.ChEMBL_1498687 (CHEMBL3582856)
IC50 2.0±n/a nM
Citation Choi, HSRucker, PVWang, ZFan, YAlbaugh, PChopiuk, GGessier, FSun, FAdrian, FLiu, GHood, TLi, NJia, YChe, JMcCormack, SLi, ALi, JSteffy, ACulazzo, ATompkins, CPhung, VKreusch, ALu, MHu, BChaudhary, APrashad, MTuntland, TLiu, BHarris, JSeidel, HMLoren, JMolteni, V (R)-2-Phenylpyrrolidine Substituted Imidazopyridazines: A New Class of Potent and Selective Pan-TRK Inhibitors. ACS Med Chem Lett6:562-7 (2015) 
 
NT-3 growth factor receptor
Name:NT-3 growth factor receptor
Type:Enzyme
Mol. Mass.:94428.15
Organism:Homo sapiens (Human)
Description:Q16288
Residue:839
BDBM50092081
NameBDBM50092081
Synonyms:CHEMBL3582442
TypeSmall organic molecule
Emp. Form.C26H27FN6O
Mol. Mass.458.5306
SMILESOC1CCN(CC1)c1cc(ccn1)-c1cnc2ccc(nn12)N1CCC[C@@H]1c1cccc(F)c1