Reaction Details
TargetCytoplasmic tyrosine-protein kinase BMX
LigandBDBM50092079
Substrate/Competitorn/a
Meas. Tech.ChEMBL_1498709 (CHEMBL3583122)
IC50>10000±n/a nM
Citation Choi, HSRucker, PVWang, ZFan, YAlbaugh, PChopiuk, GGessier, FSun, FAdrian, FLiu, GHood, TLi, NJia, YChe, JMcCormack, SLi, ALi, JSteffy, ACulazzo, ATompkins, CPhung, VKreusch, ALu, MHu, BChaudhary, APrashad, MTuntland, TLiu, BHarris, JSeidel, HMLoren, JMolteni, V (R)-2-Phenylpyrrolidine Substituted Imidazopyridazines: A New Class of Potent and Selective Pan-TRK Inhibitors. ACS Med Chem Lett6:562-7 (2015) 
 
Cytoplasmic tyrosine-protein kinase BMX
Name:Cytoplasmic tyrosine-protein kinase BMX
Type:Tyrosine-protein kinase
Mol. Mass.:78030.42
Organism:Homo sapiens (Human)
Description:P51813
Residue:675
BDBM50092079
NameBDBM50092079
Synonyms:CHEMBL3582439
TypeSmall organic molecule
Emp. Form.C21H18FN5
Mol. Mass.359.3995
SMILESFc1cccc(c1)[C@H]1CCCN1c1ccc2ncc(-c3ccccn3)n2n1