Reaction Details
TargetMast/stem cell growth factor receptor Kit
LigandBDBM50092079
Substrate/Competitorn/a
Meas. Tech.ChEMBL_1498720 (CHEMBL3583133)
IC50 5500±n/a nM
Citation Choi, HSRucker, PVWang, ZFan, YAlbaugh, PChopiuk, GGessier, FSun, FAdrian, FLiu, GHood, TLi, NJia, YChe, JMcCormack, SLi, ALi, JSteffy, ACulazzo, ATompkins, CPhung, VKreusch, ALu, MHu, BChaudhary, APrashad, MTuntland, TLiu, BHarris, JSeidel, HMLoren, JMolteni, V (R)-2-Phenylpyrrolidine Substituted Imidazopyridazines: A New Class of Potent and Selective Pan-TRK Inhibitors. ACS Med Chem Lett6:562-7 (2015) 
 
Mast/stem cell growth factor receptor Kit
Name:Mast/stem cell growth factor receptor Kit
Type:Protein
Mol. Mass.:109869.37
Organism:Homo sapiens (Human)
Description:P10721
Residue:976
BDBM50092079
NameBDBM50092079
Synonyms:CHEMBL3582439
TypeSmall organic molecule
Emp. Form.C21H18FN5
Mol. Mass.359.3995
SMILESFc1cccc(c1)[C@H]1CCCN1c1ccc2ncc(-c3ccccn3)n2n1