Reaction Details
TargetPlatelet-derived growth factor receptor beta
LigandBDBM50092081
Substrate/Competitorn/a
Meas. Tech.ChEMBL_1498725 (CHEMBL3583138)
IC50 4600±n/a nM
Citation Choi, HSRucker, PVWang, ZFan, YAlbaugh, PChopiuk, GGessier, FSun, FAdrian, FLiu, GHood, TLi, NJia, YChe, JMcCormack, SLi, ALi, JSteffy, ACulazzo, ATompkins, CPhung, VKreusch, ALu, MHu, BChaudhary, APrashad, MTuntland, TLiu, BHarris, JSeidel, HMLoren, JMolteni, V (R)-2-Phenylpyrrolidine Substituted Imidazopyridazines: A New Class of Potent and Selective Pan-TRK Inhibitors. ACS Med Chem Lett6:562-7 (2015) 
 
Platelet-derived growth factor receptor beta
Name:Platelet-derived growth factor receptor beta
Type:Enzyme
Mol. Mass.:123922.25
Organism:Homo sapiens (Human)
Description:P09619
Residue:1106
BDBM50092081
NameBDBM50092081
Synonyms:CHEMBL3582442
TypeSmall organic molecule
Emp. Form.C26H27FN6O
Mol. Mass.458.5306
SMILESOC1CCN(CC1)c1cc(ccn1)-c1cnc2ccc(nn12)N1CCC[C@@H]1c1cccc(F)c1