Reaction Details
TargetNT-3 growth factor receptor
LigandBDBM50092090
Substrate/Competitorn/a
Meas. Tech.ChEMBL_1498687 (CHEMBL3582856)
IC50 6.0±n/a nM
Citation Choi, HSRucker, PVWang, ZFan, YAlbaugh, PChopiuk, GGessier, FSun, FAdrian, FLiu, GHood, TLi, NJia, YChe, JMcCormack, SLi, ALi, JSteffy, ACulazzo, ATompkins, CPhung, VKreusch, ALu, MHu, BChaudhary, APrashad, MTuntland, TLiu, BHarris, JSeidel, HMLoren, JMolteni, V (R)-2-Phenylpyrrolidine Substituted Imidazopyridazines: A New Class of Potent and Selective Pan-TRK Inhibitors. ACS Med Chem Lett6:562-7 (2015) 
 
NT-3 growth factor receptor
Name:NT-3 growth factor receptor
Type:Enzyme
Mol. Mass.:94428.15
Organism:Homo sapiens (Human)
Description:Q16288
Residue:839
BDBM50092090
NameBDBM50092090
Synonyms:CHEMBL3582429
TypeSmall organic molecule
Emp. Form.C20H14FN5
Mol. Mass.343.3571
SMILESFc1cccc(CNc2ccc3ncc(-c4ccc(cc4)C#N)n3n2)c1