Reaction Details
TargetALK tyrosine kinase receptor
LigandBDBM50092082
Substrate/Competitorn/a
Meas. Tech.ChEMBL_1498707 (CHEMBL3583120)
IC50 2200±n/a nM
Citation Choi, HSRucker, PVWang, ZFan, YAlbaugh, PChopiuk, GGessier, FSun, FAdrian, FLiu, GHood, TLi, NJia, YChe, JMcCormack, SLi, ALi, JSteffy, ACulazzo, ATompkins, CPhung, VKreusch, ALu, MHu, BChaudhary, APrashad, MTuntland, TLiu, BHarris, JSeidel, HMLoren, JMolteni, V (R)-2-Phenylpyrrolidine Substituted Imidazopyridazines: A New Class of Potent and Selective Pan-TRK Inhibitors. ACS Med Chem Lett6:562-7 (2015) 
 
ALK tyrosine kinase receptor
Name:ALK tyrosine kinase receptor
Type:Protein
Mol. Mass.:176453.10
Organism:Homo sapiens (Human)
Description:Q9UM73
Residue:1620
BDBM50092082
NameBDBM50092082
Synonyms:CHEMBL3582441
TypeSmall organic molecule
Emp. Form.C27H28FN7O2
Mol. Mass.501.5553
SMILESOC(=O)CN1CCN(CC1)c1cc(ccn1)-c1cnc2ccc(nn12)N1CCC[C@@H]1c1cccc(F)c1