Reaction Details
TargetBDNF/NT-3 growth factors receptor
LigandBDBM50092132
Substrate/Competitorn/a
Meas. Tech.ChEMBL_1498686 (CHEMBL3582855)
IC50 4.0±n/a nM
Citation Choi, HSRucker, PVWang, ZFan, YAlbaugh, PChopiuk, GGessier, FSun, FAdrian, FLiu, GHood, TLi, NJia, YChe, JMcCormack, SLi, ALi, JSteffy, ACulazzo, ATompkins, CPhung, VKreusch, ALu, MHu, BChaudhary, APrashad, MTuntland, TLiu, BHarris, JSeidel, HMLoren, JMolteni, V (R)-2-Phenylpyrrolidine Substituted Imidazopyridazines: A New Class of Potent and Selective Pan-TRK Inhibitors. ACS Med Chem Lett6:562-7 (2015) 
 
BDNF/NT-3 growth factors receptor
Name:BDNF/NT-3 growth factors receptor
Type:Enzyme
Mol. Mass.:91996.87
Organism:Homo sapiens (Human)
Description:Q16620
Residue:822
BDBM50092132
NameBDBM50092132
Synonyms:CHEMBL3582440
TypeSmall organic molecule
Emp. Form.C26H27FN6O
Mol. Mass.458.5306
SMILESOC1CCN(CC1)c1cccc(n1)-c1cnc2ccc(nn12)N1CCC[C@@H]1c1cccc(F)c1