Reaction Details
TargetBDNF/NT-3 growth factors receptor
LigandBDBM50092087
Substrate/Competitorn/a
Meas. Tech.ChEMBL_1498686 (CHEMBL3582855)
IC50 130±n/a nM
Citation Choi, HSRucker, PVWang, ZFan, YAlbaugh, PChopiuk, GGessier, FSun, FAdrian, FLiu, GHood, TLi, NJia, YChe, JMcCormack, SLi, ALi, JSteffy, ACulazzo, ATompkins, CPhung, VKreusch, ALu, MHu, BChaudhary, APrashad, MTuntland, TLiu, BHarris, JSeidel, HMLoren, JMolteni, V (R)-2-Phenylpyrrolidine Substituted Imidazopyridazines: A New Class of Potent and Selective Pan-TRK Inhibitors. ACS Med Chem Lett6:562-7 (2015) 
 
BDNF/NT-3 growth factors receptor
Name:BDNF/NT-3 growth factors receptor
Type:Enzyme
Mol. Mass.:91996.87
Organism:Homo sapiens (Human)
Description:Q16620
Residue:822
BDBM50092087
NameBDBM50092087
Synonyms:CHEMBL3580682
TypeSmall organic molecule
Emp. Form.C21H17N5
Mol. Mass.339.3932
SMILESCN(Cc1ccccc1)c1ccc2ncc(-c3ccc(cc3)C#N)n2n1