Reaction Details
TargetSteroid 21-hydroxylase
LigandBDBM50092137
Substrate/Competitorn/a
Meas. Tech.ChEMBL_1498865 (CHEMBL3583945)
IC50>10000±n/a nM
Citation Hoyt, SBPark, MKLondon, CXiong, YTata, JBennett, DJCooke, ACai, JCarswell, ERobinson, JMacLean, JBrown, LBelshaw, SClarkson, TRLiu, KLiang, GBStruthers, MCully, DWisniewski, TRen, NBopp, CSok, ACai, TQStribling, SPai, LYMa, XMetzger, JVerras, AMcMasters, DChen, QTung, ETang, WSalituro, GBuist, NKuethe, JRivera, NClemas, JZhou, GGibson, JMaxwell, CALassman, MMcLaughlin, TCastro-Perez, JSzeto, DForrest, GHajdu, RRosenbach, MAli, A Discovery of Benzimidazole CYP11B2 Inhibitors with in Vivo Activity in Rhesus Monkeys. ACS Med Chem Lett6:573-8 (2015) 
 
Steroid 21-hydroxylase
Name:Steroid 21-hydroxylase
Type:PROTEIN
Mol. Mass.:55896.25
Organism:Homo sapiens (Human)
Description:ChEMBL_1498865
Residue:494
BDBM50092137
NameBDBM50092137
Synonyms:CHEMBL3582481
TypeSmall organic molecule
Emp. Form.C16H12F3N3
Mol. Mass.303.2818
SMILESCc1c(F)cncc1-c1nc2cc(F)c(F)cc2n1C1CC1