Reaction Details
TargetCytochrome P450 11B1, mitochondrial
LigandBDBM50092142
Substrate/Competitorn/a
Meas. Tech.ChEMBL_1498858 (CHEMBL3583832)
IC50 42±n/a nM
Citation Hoyt, SBPark, MKLondon, CXiong, YTata, JBennett, DJCooke, ACai, JCarswell, ERobinson, JMacLean, JBrown, LBelshaw, SClarkson, TRLiu, KLiang, GBStruthers, MCully, DWisniewski, TRen, NBopp, CSok, ACai, TQStribling, SPai, LYMa, XMetzger, JVerras, AMcMasters, DChen, QTung, ETang, WSalituro, GBuist, NKuethe, JRivera, NClemas, JZhou, GGibson, JMaxwell, CALassman, MMcLaughlin, TCastro-Perez, JSzeto, DForrest, GHajdu, RRosenbach, MAli, A Discovery of Benzimidazole CYP11B2 Inhibitors with in Vivo Activity in Rhesus Monkeys. ACS Med Chem Lett6:573-8 (2015) 
 
Cytochrome P450 11B1, mitochondrial
Name:Cytochrome P450 11B1, mitochondrial
Type:Enzyme
Mol. Mass.:57591.44
Organism:Homo sapiens (Human)
Description:P15538
Residue:503
BDBM50092142
NameBDBM50092142
Synonyms:CHEMBL3582477
TypeSmall organic molecule
Emp. Form.C18H17F2N3O
Mol. Mass.329.3439
SMILESCC(C)(O)c1cncc(c1)-c1nc2cc(F)c(F)cc2n1C1CC1