Reaction Details
TargetCytochrome P450 11B2, mitochondrial
LigandBDBM50092191
Substrate/Competitorn/a
Meas. Tech.ChEMBL_1498857 (CHEMBL3583831)
IC50 0.600000±n/a nM
Citation Hoyt, SBPark, MKLondon, CXiong, YTata, JBennett, DJCooke, ACai, JCarswell, ERobinson, JMacLean, JBrown, LBelshaw, SClarkson, TRLiu, KLiang, GBStruthers, MCully, DWisniewski, TRen, NBopp, CSok, ACai, TQStribling, SPai, LYMa, XMetzger, JVerras, AMcMasters, DChen, QTung, ETang, WSalituro, GBuist, NKuethe, JRivera, NClemas, JZhou, GGibson, JMaxwell, CALassman, MMcLaughlin, TCastro-Perez, JSzeto, DForrest, GHajdu, RRosenbach, MAli, A Discovery of Benzimidazole CYP11B2 Inhibitors with in Vivo Activity in Rhesus Monkeys. ACS Med Chem Lett6:573-8 (2015) 
 
Cytochrome P450 11B2, mitochondrial
Name:Cytochrome P450 11B2, mitochondrial
Type:Protein
Mol. Mass.:57582.15
Organism:Homo sapiens (Human)
Description:P19099
Residue:503
BDBM50092191
NameBDBM50092191
Synonyms:CHEMBL3582483
TypeSmall organic molecule
Emp. Form.C17H15F2N3O
Mol. Mass.315.3173
SMILESCOc1c(C)cncc1-c1nc2cc(F)c(F)cc2n1C1CC1