Reaction Details
TargetDelta-type opioid receptor
LigandBDBM50096791
Substrate/Competitorn/a
Meas. Tech.ChEMBL_1498897 (CHEMBL3584104)
IC50 429±n/a nM
Citation Piekielna, JPerlikowska, Rdo-Rego, JCdo-Rego, JLCerlesi, MCCalo, GKluczyk, ALapinski, KTömböly, CJanecka, A Synthesis of mixed opioid affinity cyclic endomorphin-2 analogues with fluorinated phenylalanines. ACS Med Chem Lett6:579-83 (2015) 
 
Delta-type opioid receptor
Name:Delta-type opioid receptor
Type:G Protein-Coupled Receptor (GPCR)
Mol. Mass.:40465.04
Organism:Rattus norvegicus (rat)
Description:Competition binding assays were using CHO-K1 cell membranes expressing the opioid receptor.
Residue:372
BDBM50096791
NameBDBM50096791
Synonyms:CHEMBL3580744
TypeSmall organic molecule
Emp. Form.C38H44F3N7O7
Mol. Mass.767.7939
SMILESN[C@@H](Cc1ccc(O)cc1)C(=O)N[C@@H]1CCCCNC(=O)C[C@H](NC(=O)[C@H](Cc2ccc(cc2)C(F)(F)F)NC(=O)[C@H](Cc2ccccc2)NC1=O)C(N)=O