Reaction Details
TargetMu-type opioid receptor
LigandBDBM50096791
Substrate/Competitorn/a
Meas. Tech.ChEMBL_1499012 (CHEMBL3584507)
EC50 5.2±n/a nM
Citation Piekielna, JPerlikowska, Rdo-Rego, JCdo-Rego, JLCerlesi, MCCalo, GKluczyk, ALapinski, KTömböly, CJanecka, A Synthesis of mixed opioid affinity cyclic endomorphin-2 analogues with fluorinated phenylalanines. ACS Med Chem Lett6:579-83 (2015) 
 
Mu-type opioid receptor
Name:Mu-type opioid receptor
Type:G Protein-Coupled Receptor (GPCR)
Mol. Mass.:44789.51
Organism:Homo sapiens (Human)
Description:P35372
Residue:400
BDBM50096791
NameBDBM50096791
Synonyms:CHEMBL3580744
TypeSmall organic molecule
Emp. Form.C38H44F3N7O7
Mol. Mass.767.7939
SMILESN[C@@H](Cc1ccc(O)cc1)C(=O)N[C@@H]1CCCCNC(=O)C[C@H](NC(=O)[C@H](Cc2ccc(cc2)C(F)(F)F)NC(=O)[C@H](Cc2ccccc2)NC1=O)C(N)=O