Reaction Details
TargetKappa-type opioid receptor
LigandBDBM50096787
Substrate/Competitorn/a
Meas. Tech.ChEMBL_1498898 (CHEMBL3584105)
IC50 0.300000±n/a nM
Citation Piekielna, JPerlikowska, Rdo-Rego, JCdo-Rego, JLCerlesi, MCCalo, GKluczyk, ALapinski, KTömböly, CJanecka, A Synthesis of mixed opioid affinity cyclic endomorphin-2 analogues with fluorinated phenylalanines. ACS Med Chem Lett6:579-83 (2015) 
 
Kappa-type opioid receptor
Name:Kappa-type opioid receptor
Type:G Protein-Coupled Receptor (GPCR)
Mol. Mass.:42744.99
Organism:Cavia porcellus (domestic guinea pig)
Description:P41144
Residue:380
BDBM50096787
NameBDBM50096787
Synonyms:CHEMBL3580749
TypeSmall organic molecule
Emp. Form.C39H47F2N7O7
Mol. Mass.763.83
SMILESCc1cc(O)cc(C)c1C[C@H](N)C(=O)N[C@@H]1CCCCNC(=O)C[C@H](NC(=O)[C@H](Cc2ccc(F)cc2F)NC(=O)[C@H](Cc2ccccc2)NC1=O)C(N)=O