Reaction Details
TargetBromodomain-containing protein 3
LigandBDBM50365463
Substrate/Competitorn/a
Meas. Tech.ChEMBL_1498190 (CHEMBL3583514)
Kd 41±n/a nM
Citation Ran, XZhao, YLiu, LBai, LYang, CYZhou, BMeagher, JLChinnaswamy, KStuckey, JAWang, S Structure-Based Design of¿-Carboline Analogues as Potent and Specific BET Bromodomain Inhibitors. J Med Chem58:4927-39 (2015) 
 
Bromodomain-containing protein 3
Name:Bromodomain-containing protein 3
Type:Protein
Mol. Mass.:79571.81
Organism:Homo sapiens (Human)
Description:Q15059
Residue:726
BDBM50365463
NameBDBM50365463
Synonyms:CHEMBL1232461
TypeSmall organic molecule
Emp. Form.C22H22ClN5O2
Mol. Mass.423.895
SMILESCCNC(=O)C[C@@H]1N=C(c2ccc(Cl)cc2)c2cc(OC)ccc2-n2c(C)nnc12