Reaction Details
TargetCannabinoid receptor 1
LigandBDBM50092344
Substrate/Competitorn/a
Meas. Tech.ChEMBL_1500630 (CHEMBL3587760)
Ki 224±n/a nM
Citation Radwan, MMElSohly, MAEl-Alfy, ATAhmed, SASlade, DHusni, ASManly, SPWilson, LSeale, SCutler, SJRoss, SA Isolation and Pharmacological Evaluation of Minor Cannabinoids from High-Potency Cannabis sativa. J Nat Prod78:1271-6 (2015) 
 
Cannabinoid receptor 1
Name:Cannabinoid receptor 1
Type:G Protein-Coupled Receptor (GPCR)
Mol. Mass.:52868.96
Organism:Homo sapiens (Human)
Description:P21554
Residue:472
BDBM50092344
NameBDBM50092344
Synonyms:CHEMBL3586109
TypeSmall organic molecule
Emp. Form.C21H30O3
Mol. Mass.330.4611
SMILES[H][C@@]12O[C@]1(C)CC[C@]1([H])[C@]2([H])c2c(O)cc(CCCCC)cc2OC1(C)C