Reaction Details
TargetCarbonic anhydrase 2
LigandBDBM50092544
Substrate/Competitorn/a
Meas. Tech.ChEMBL_1500872 (CHEMBL3588512)
Ki>10000±n/a nM
Citation Carradori, SMollica, ACeruso, MD'Ascenzio, MDe Monte, CChimenti, PSabia, RAkdemir, ASupuran, CT New amide derivatives of Probenecid as selective inhibitors of carbonic anhydrase IX and XII: biological evaluation and molecular modelling studies. Bioorg Med Chem23:2975-81 (2015) 
 
Carbonic anhydrase 2
Name:Carbonic anhydrase 2
Type:Enzyme
Mol. Mass.:29250.71
Organism:Homo sapiens (Human)
Description:P00918
Residue:260
BDBM50092544
NameBDBM50092544
Synonyms:CHEMBL3586219
TypeSmall organic molecule
Emp. Form.C18H23N3O3S
Mol. Mass.361.459
SMILESCCCN(CCC)S(=O)(=O)c1ccc(cc1)C(=O)Nc1ccncc1