Reaction Details
TargetCarbonic anhydrase 9
LigandBDBM50092602
Substrate/Competitorn/a
Meas. Tech.ChEMBL_1500873 (CHEMBL3588513)
Ki 110±n/a nM
Citation Carradori, SMollica, ACeruso, MD'Ascenzio, MDe Monte, CChimenti, PSabia, RAkdemir, ASupuran, CT New amide derivatives of Probenecid as selective inhibitors of carbonic anhydrase IX and XII: biological evaluation and molecular modelling studies. Bioorg Med Chem23:2975-81 (2015) 
 
Carbonic anhydrase 9
Name:Carbonic anhydrase 9
Type:Enzyme
Mol. Mass.:49669.03
Organism:Homo sapiens (Human)
Description:Catalytic domain of human cloned isozyme was used in the assay
Residue:459
BDBM50092602
NameBDBM50092602
Synonyms:CHEMBL3586216
TypeSmall organic molecule
Emp. Form.C19H33N3O3S
Mol. Mass.383.549
SMILESCCCN(CCC)S(=O)(=O)c1ccc(cc1)C(=O)NCCN(CC)CC