Reaction Details
TargetCarbonic anhydrase 12
LigandBDBM50092597
Substrate/Competitorn/a
Meas. Tech.ChEMBL_1500874 (CHEMBL3588514)
Ki 965±n/a nM
Citation Carradori, SMollica, ACeruso, MD'Ascenzio, MDe Monte, CChimenti, PSabia, RAkdemir, ASupuran, CT New amide derivatives of Probenecid as selective inhibitors of carbonic anhydrase IX and XII: biological evaluation and molecular modelling studies. Bioorg Med Chem23:2975-81 (2015) 
 
Carbonic anhydrase 12
Name:Carbonic anhydrase 12
Type:Enzyme
Mol. Mass.:39456.00
Organism:Homo sapiens (Human)
Description:Catalytic domain of human cloned isozyme was used in the assay
Residue:354
BDBM50092597
NameBDBM50092597
Synonyms:CHEMBL3586211
TypeSmall organic molecule
Emp. Form.C15H24N2O3S
Mol. Mass.312.428
SMILESCCCN(CCC)S(=O)(=O)c1ccc(cc1)C(=O)NCC