Reaction Details
TargetProlyl 4-hydroxylase subunit alpha-1
LigandBDBM50042876
Substrate/Competitorn/a
Meas. Tech.ChEMBL_1500973 (CHEMBL3587050)
pH7.8±n/a
Ki 140±n/a nM
Commentsextracted
Citation Vasta, JDRaines, RT Selective inhibition of prolyl 4-hydroxylases by bipyridinedicarboxylates. Bioorg Med Chem23:3081-90 (2015) 
 
Prolyl 4-hydroxylase subunit alpha-1
Name:Prolyl 4-hydroxylase subunit alpha-1
Type:PROTEIN
Mol. Mass.:61043.51
Organism:Homo sapiens (Human)
Description:ChEMBL_103483
Residue:534
BDBM50042876
NameBDBM50042876
Synonyms:CHEMBL332005 | [2,2']Bipyridinyl-5,5'-dicarboxylic acid
TypeSmall organic molecule
Emp. Form.C12H8N2O4
Mol. Mass.244.2029
SMILESOC(=O)c1ccc(nc1)-c1ccc(cn1)C(O)=O