Reaction Details
TargetTyrosine-protein phosphatase non-receptor type 1
LigandBDBM50346601
Substrate/Competitorn/a
Meas. Tech.ChEMBL_1501659 (CHEMBL3587478)
IC50 1000±n/a nM
Citation Abdjul, DBYamazaki, HKanno, STakahashi, OKirikoshi, RUkai, KNamikoshi, M Structures and Biological Evaluations of Agelasines Isolated from the Okinawan Marine Sponge Agelas nakamurai. J Nat Prod78:1428-33 (2015) 
 
Tyrosine-protein phosphatase non-receptor type 1
Name:Tyrosine-protein phosphatase non-receptor type 1
Type:Protein phosphatase
Mol. Mass.:49963.76
Organism:Homo sapiens (Human)
Description:Human recombinant GST-fusion PTP1B (1-435).
Residue:435
BDBM50346601
NameBDBM50346601
Synonyms:NSC-114945 Oleanolic acid US11660306, Example Oleanolic acid
TypeSmall organic molecule
Emp. Form.C30H48O3
Mol. Mass.456.7003
SMILESCC1(C)CC[C@@]2(CC[C@]3(C)C(=CC[C@@H]4[C@@]5(C)CC[C@H](O)C(C)(C)[C@@H]5CC[C@@]34C)[C@@H]2C1)C(O)=O