Reaction Details
TargetOrexin receptor type 2
LigandBDBM50092810
Substrate/Competitorn/a
Meas. Tech.ChEMBL_1501893 (CHEMBL3588151)
Ki 25±n/a nM
Citation Letavic, MABonaventure, PCarruthers, NIDugovic, CKoudriakova, TLord, BLovenberg, TWLy, KSMani, NSNepomuceno, DPippel, DJRizzolio, MShelton, JEShah, CRShireman, BTYoung, LKYun, S Novel Octahydropyrrolo[3,4-c]pyrroles Are Selective Orexin-2 Antagonists: SAR Leading to a Clinical Candidate. J Med Chem58:5620-36 (2015) 
 
Orexin receptor type 2
Name:Orexin receptor type 2
Type:Protein
Mol. Mass.:50710.53
Organism:Homo sapiens (Human)
Description:O43614
Residue:444
BDBM50092810
NameBDBM50092810
Synonyms:CHEMBL3586412
TypeSmall organic molecule
Emp. Form.C21H22ClN3O3S
Mol. Mass.431.936
SMILESCOc1cccc(OC)c1C(=O)N1CCCN(CC1)c1nc2ccc(Cl)cc2s1