Reaction Details
TargetOrexin receptor type 2
LigandBDBM50097381
Substrate/Competitorn/a
Meas. Tech.ChEMBL_1501663 (CHEMBL3587482)
Ki 41±n/a nM
Citation Letavic, MABonaventure, PCarruthers, NIDugovic, CKoudriakova, TLord, BLovenberg, TWLy, KSMani, NSNepomuceno, DPippel, DJRizzolio, MShelton, JEShah, CRShireman, BTYoung, LKYun, S Novel Octahydropyrrolo[3,4-c]pyrroles Are Selective Orexin-2 Antagonists: SAR Leading to a Clinical Candidate. J Med Chem58:5620-36 (2015) 
 
Orexin receptor type 2
Name:Orexin receptor type 2
Type:Protein
Mol. Mass.:50710.53
Organism:Homo sapiens (Human)
Description:O43614
Residue:444
BDBM50097381
NameBDBM50097381
Synonyms:CHEMBL3586431
TypeSmall organic molecule
Emp. Form.C23H24N4O3S
Mol. Mass.436.527
SMILES[H][C@@]12CN(C[C@]1([H])CN(C2)c1nc(OC)cc(OC)n1)C(=O)c1ccccc1-c1cccs1