Reaction Details
TargetSerine/threonine-protein kinase mTOR
LigandBDBM50093069
Substrate/Competitorn/a
Meas. Tech.ChEMBL_1500545 (CHEMBL3587521)
IC50 12±n/a nM
Citation Mortensen, DSPerrin-Ninkovic, SMShevlin, GElsner, JZhao, JWhitefield, BTehrani, LSapienza, JRiggs, JRParnes, JSPapa, PPackard, GLee, BGHarris, RCorrea, MBahmanyar, SRichardson, SJPeng, SXLeisten, JKhambatta, GHickman, MGamez, JCBisonette, RRApuy, JCathers, BECanan, SSMoghaddam, MFRaymon, HKWorland, PNarla, RKFultz, KESankar, S Optimization of a Series of Triazole Containing Mammalian Target of Rapamycin (mTOR) Kinase Inhibitors and the Discovery of CC-115. J Med Chem58:5599-608 (2015) 
 
Serine/threonine-protein kinase mTOR
Name:Serine/threonine-protein kinase mTOR
Type:Rapamycin target protein
Mol. Mass.:288917.12
Organism:Homo sapiens (Human)
Description:P42345
Residue:2549
BDBM50093069
NameBDBM50093069
Synonyms:CHEMBL3586560
TypeSmall organic molecule
Emp. Form.C20H22N8O2
Mol. Mass.406.4411
SMILESCc1nc(ccc1-c1cnc2NCC(=O)N(CC3CCOCC3)c2n1)-c1nc[nH]n1