Reaction Details
TargetFKBP12A/mTOR
LigandBDBM50093071
Substrate/Competitorn/a
Meas. Tech.ChEMBL_1500546 (CHEMBL3587522)
IC50 27±n/a nM
Citation Mortensen, DSPerrin-Ninkovic, SMShevlin, GElsner, JZhao, JWhitefield, BTehrani, LSapienza, JRiggs, JRParnes, JSPapa, PPackard, GLee, BGHarris, RCorrea, MBahmanyar, SRichardson, SJPeng, SXLeisten, JKhambatta, GHickman, MGamez, JCBisonette, RRApuy, JCathers, BECanan, SSMoghaddam, MFRaymon, HKWorland, PNarla, RKFultz, KESankar, S Optimization of a Series of Triazole Containing Mammalian Target of Rapamycin (mTOR) Kinase Inhibitors and the Discovery of CC-115. J Med Chem58:5599-608 (2015) 
 
FKBP12A/mTOR
Name:FKBP12A/mTOR
Type:n/a
Mol. Mass.:n/a
Description:ASSAY_ID of ChEMBL is 2232618
Components:This complex has 2 components.
Component 1
Name:Peptidyl-prolyl cis-trans isomerase FKBP1A
Synonyms:12 kDa FK506-binding protein FK506-binding protein 1A FKB1A_HUMAN FKBP-1A FKBP12 Immunophilin FKBP12 PPIase FKBP1A Rotamase mTOR/FKBP12A/FKBP12B
Type:Isomerase
Mol. Mass.:11953.09
Organism:Homo sapiens (Human)
Description:P62942
Residue:108
Component 2
Name:Serine/threonine-protein kinase mTOR
Synonyms:FK506-binding protein 12-rapamycin complex-associated protein 1 FRAP FRAP1 MTOR Mammalian Target of Rapamycin (mTOR) RAFT1 Rapamycin and FKBP12 target 1 Serine/threonine-protein kinase (mTOR) | mTORC2
Type:Rapamycin target protein
Mol. Mass.:288917.12
Organism:Homo sapiens (Human)
Description:P42345
Residue:2549
BDBM50093071
NameBDBM50093071
Synonyms:CHEMBL3586562
TypeSmall organic molecule
Emp. Form.C22H26N8O2
Mol. Mass.434.4942
SMILESCO[C@H]1CC[C@H](CN2C(=O)CNc3ncc(nc23)-c2ccc(nc2C)-c2nc[nH]n2)CC1