Reaction Details
TargetGlycogen synthase kinase-3 beta
LigandBDBM50093352
Substrate/Competitorn/a
Meas. Tech.ChEMBL_1500404 (CHEMBL3587037)
Ki>4000±n/a nM
Citation Collier, PNMessersmith, DLe Tiran, ABandarage, UKBoucher, CCome, JCottrell, KMDamagnez, VDoran, JDGriffith, JPKhare-Pandit, SKrueger, EBLedeboer, MWLedford, BLiao, YMahajan, SMoody, CSRoday, SWang, TXu, JAronov, AM Discovery of Highly Isoform Selective Thiazolopiperidine Inhibitors of Phosphoinositide 3-Kinase¿. J Med Chem58:5684-8 (2015) 
 
Glycogen synthase kinase-3 beta
Name:Glycogen synthase kinase-3 beta
Type:Enzyme
Mol. Mass.:46756.38
Organism:Homo sapiens (Human)
Description:P49841
Residue:420
BDBM50093352
NameBDBM50093352
Synonyms:CHEMBL3586678
TypeSmall organic molecule
Emp. Form.C19H22F2N8O2S
Mol. Mass.464.492
SMILESCOc1cncc(n1)N1CCc2nc(NC(=O)NCCc3cn(CC(F)F)cn3)sc2C1