Reaction Details
TargetBromodomain-containing protein 2
LigandBDBM50096300
Substrate/Competitorn/a
Meas. Tech.ChEMBL_1500550 (CHEMBL3587526)
IC50 6310±n/a nM
Citation Demont, EHChung, CWFurze, RCGrandi, PMichon, AMWellaway, CBarrett, NBridges, AMCraggs, PDDiallo, HDixon, DPDouault, CEmmons, AJJones, EJKaramshi, BVLocke, KMitchell, DJMouzon, BHPrinjha, RKRoberts, ADSheppard, RJWatson, RJBamborough, P Fragment-Based Discovery of Low-Micromolar ATAD2 Bromodomain Inhibitors. J Med Chem58:5649-73 (2015) 
 
Bromodomain-containing protein 2
Name:Bromodomain-containing protein 2
Type:Protein
Mol. Mass.:88085.95
Organism:Homo sapiens (Human)
Description:P25440
Residue:801
BDBM50096300
NameBDBM50096300
Synonyms:CHEMBL3585452
TypeSmall organic molecule
Emp. Form.C20H23N5O
Mol. Mass.349.4295
SMILESCc1cncc(c1)-c1cnc(NC2CCNCC2)c2[nH]c(=O)c(C)cc12