Reaction Details
TargetBromodomain-containing protein 4
LigandBDBM50096319
Substrate/Competitorn/a
Meas. Tech.ChEMBL_1500427 (CHEMBL3587158)
IC50 3981±n/a nM
Citation Demont, EHChung, CWFurze, RCGrandi, PMichon, AMWellaway, CBarrett, NBridges, AMCraggs, PDDiallo, HDixon, DPDouault, CEmmons, AJJones, EJKaramshi, BVLocke, KMitchell, DJMouzon, BHPrinjha, RKRoberts, ADSheppard, RJWatson, RJBamborough, P Fragment-Based Discovery of Low-Micromolar ATAD2 Bromodomain Inhibitors. J Med Chem58:5649-73 (2015) 
 
Bromodomain-containing protein 4
Name:Bromodomain-containing protein 4
Type:Protein
Mol. Mass.:152264.84
Organism:Homo sapiens (Human)
Description:O60885
Residue:1362
BDBM50096319
NameBDBM50096319
Synonyms:CHEMBL3586718
TypeSmall organic molecule
Emp. Form.C17H22N4O
Mol. Mass.298.3828
SMILES[H][C@]12CC[C@]([H])(C[C@H](C1)Nc1nccc3cc(C)c(=O)[nH]c13)N2C