Reaction Details
TargetATPase family AAA domain-containing protein 2
LigandBDBM50093449
Substrate/Competitorn/a
Meas. Tech.ChEMBL_1500426 (CHEMBL3587157)
IC50 79433±n/a nM
Citation Demont, EHChung, CWFurze, RCGrandi, PMichon, AMWellaway, CBarrett, NBridges, AMCraggs, PDDiallo, HDixon, DPDouault, CEmmons, AJJones, EJKaramshi, BVLocke, KMitchell, DJMouzon, BHPrinjha, RKRoberts, ADSheppard, RJWatson, RJBamborough, P Fragment-Based Discovery of Low-Micromolar ATAD2 Bromodomain Inhibitors. J Med Chem58:5649-73 (2015) 
 
ATPase family AAA domain-containing protein 2
Name:ATPase family AAA domain-containing protein 2
Type:PROTEIN
Mol. Mass.:158546.30
Organism:Homo sapiens (Human)
Description:ChEMBL_1500426
Residue:1390
BDBM50093449
NameBDBM50093449
Synonyms:CHEMBL3586702
TypeSmall organic molecule
Emp. Form.C13H16N4O
Mol. Mass.244.2923
SMILESCc1cc2ccnc(N[C@@H]3CCNC3)c2[nH]c1=O