Reaction Details
TargetBromodomain-containing protein 4
LigandBDBM50096321
Substrate/Competitorn/a
Meas. Tech.ChEMBL_1500427 (CHEMBL3587158)
IC50 1000±n/a nM
Citation Demont, EHChung, CWFurze, RCGrandi, PMichon, AMWellaway, CBarrett, NBridges, AMCraggs, PDDiallo, HDixon, DPDouault, CEmmons, AJJones, EJKaramshi, BVLocke, KMitchell, DJMouzon, BHPrinjha, RKRoberts, ADSheppard, RJWatson, RJBamborough, P Fragment-Based Discovery of Low-Micromolar ATAD2 Bromodomain Inhibitors. J Med Chem58:5649-73 (2015) 
 
Bromodomain-containing protein 4
Name:Bromodomain-containing protein 4
Type:Protein
Mol. Mass.:152264.84
Organism:Homo sapiens (Human)
Description:O60885
Residue:1362
BDBM50096321
NameBDBM50096321
Synonyms:CHEMBL3586720
TypeSmall organic molecule
Emp. Form.C24H27N5O2
Mol. Mass.417.5035
SMILESCC(=O)N1CCc2cc(ccc12)-c1cnc(NC2CCNCC2)c2[nH]c(=O)c(C)cc12