Reaction Details
TargetBromodomain-containing protein 3
LigandBDBM50096282
Substrate/Competitorn/a
Meas. Tech.ChEMBL_1500553 (CHEMBL3587529)
IC50 19953±n/a nM
Citation Demont, EHChung, CWFurze, RCGrandi, PMichon, AMWellaway, CBarrett, NBridges, AMCraggs, PDDiallo, HDixon, DPDouault, CEmmons, AJJones, EJKaramshi, BVLocke, KMitchell, DJMouzon, BHPrinjha, RKRoberts, ADSheppard, RJWatson, RJBamborough, P Fragment-Based Discovery of Low-Micromolar ATAD2 Bromodomain Inhibitors. J Med Chem58:5649-73 (2015) 
 
Bromodomain-containing protein 3
Name:Bromodomain-containing protein 3
Type:Protein
Mol. Mass.:79571.81
Organism:Homo sapiens (Human)
Description:Q15059
Residue:726
BDBM50096282
NameBDBM50096282
Synonyms:CHEMBL3585455
TypeSmall organic molecule
Emp. Form.C20H23N5O2
Mol. Mass.365.4289
SMILESCOc1cncc(c1)-c1cnc(NC2CCNCC2)c2[nH]c(=O)c(C)cc12