Reaction Details
TargetBromodomain-containing protein 4
LigandBDBM50093452
Substrate/Competitorn/a
Meas. Tech.ChEMBL_1500427 (CHEMBL3587158)
IC50 12589±n/a nM
Citation Demont, EHChung, CWFurze, RCGrandi, PMichon, AMWellaway, CBarrett, NBridges, AMCraggs, PDDiallo, HDixon, DPDouault, CEmmons, AJJones, EJKaramshi, BVLocke, KMitchell, DJMouzon, BHPrinjha, RKRoberts, ADSheppard, RJWatson, RJBamborough, P Fragment-Based Discovery of Low-Micromolar ATAD2 Bromodomain Inhibitors. J Med Chem58:5649-73 (2015) 
 
Bromodomain-containing protein 4
Name:Bromodomain-containing protein 4
Type:Protein
Mol. Mass.:152264.84
Organism:Homo sapiens (Human)
Description:O60885
Residue:1362
BDBM50093452
NameBDBM50093452
Synonyms:CHEMBL3586705
TypeSmall organic molecule
Emp. Form.C16H22N4O
Mol. Mass.286.3721
SMILESCc1cc2ccnc(NCCC3CCNCC3)c2[nH]c1=O