Reaction Details
TargetATPase family AAA domain-containing protein 2
LigandBDBM50096322
Substrate/Competitorn/a
Meas. Tech.ChEMBL_1500426 (CHEMBL3587157)
IC50 39811±n/a nM
Citation Demont, EHChung, CWFurze, RCGrandi, PMichon, AMWellaway, CBarrett, NBridges, AMCraggs, PDDiallo, HDixon, DPDouault, CEmmons, AJJones, EJKaramshi, BVLocke, KMitchell, DJMouzon, BHPrinjha, RKRoberts, ADSheppard, RJWatson, RJBamborough, P Fragment-Based Discovery of Low-Micromolar ATAD2 Bromodomain Inhibitors. J Med Chem58:5649-73 (2015) 
 
ATPase family AAA domain-containing protein 2
Name:ATPase family AAA domain-containing protein 2
Type:PROTEIN
Mol. Mass.:158546.30
Organism:Homo sapiens (Human)
Description:ChEMBL_1500426
Residue:1390
BDBM50096322
NameBDBM50096322
Synonyms:CHEMBL3586726
TypeSmall organic molecule
Emp. Form.C19H21N5O
Mol. Mass.335.4029
SMILESCc1cc2c(cnc(NC3CCNCC3)c2[nH]c1=O)-c1ccccn1