Reaction Details
TargetCarbonic anhydrase 12
LigandBDBM50093559
Substrate/Competitorn/a
Meas. Tech.ChEMBL_1501466 (CHEMBL3588572)
Ki 78±n/a nM
Citation Mojzych, MCeruso, MBielawska, ABielawski, KFornal, ESupuran, CT New pyrazolo[4,3-e][1,2,4]triazine sulfonamides as carbonic anhydrase inhibitors. Bioorg Med Chem23:3674-80 (2015) 
 
Carbonic anhydrase 12
Name:Carbonic anhydrase 12
Type:Enzyme
Mol. Mass.:39456.00
Organism:Homo sapiens (Human)
Description:Catalytic domain of human cloned isozyme was used in the assay
Residue:354
BDBM50093559
NameBDBM50093559
Synonyms:CHEMBL3585753
TypeSmall organic molecule
Emp. Form.C23H26N6O4S
Mol. Mass.482.555
SMILESCCOc1ccc(cc1-c1nnc2n(nc(C)c2n1)-c1ccc(C)cc1)S(=O)(=O)NC[C@@H](C)O