Reaction Details
TargetCarbonic anhydrase 1
LigandBDBM50093555
Substrate/Competitorn/a
Meas. Tech.ChEMBL_1501463 (CHEMBL3588569)
Ki 854±n/a nM
Citation Mojzych, MCeruso, MBielawska, ABielawski, KFornal, ESupuran, CT New pyrazolo[4,3-e][1,2,4]triazine sulfonamides as carbonic anhydrase inhibitors. Bioorg Med Chem23:3674-80 (2015) 
 
Carbonic anhydrase 1
Name:Carbonic anhydrase 1
Type:Enzyme
Mol. Mass.:28873.37
Organism:Homo sapiens (Human)
Description:P00915
Residue:261
BDBM50093555
NameBDBM50093555
Synonyms:CHEMBL3585757
TypeSmall organic molecule
Emp. Form.C24H26ClN7O3S
Mol. Mass.528.026
SMILESCCOc1ccc(cc1-c1nnc2n(nc(C)c2n1)-c1ccc(Cl)cc1)S(=O)(=O)N1CCN(C)CC1