Reaction Details
TargetAngiotensin-converting enzyme
LigandBDBM50084681
Substrate/Competitorn/a
Meas. Tech.ChEMBL_1501476 (CHEMBL3586838)
IC50 253±n/a nM
Citation Jallapally, AAddla, DBagul, PSridhar, BBanerjee, SKKantevari, S Design, synthesis and evaluation of novel 2-butyl-4-chloroimidazole derived peptidomimetics as Angiotensin Converting Enzyme (ACE) inhibitors. Bioorg Med Chem23:3526-33 (2015) 
 
Angiotensin-converting enzyme
Name:Angiotensin-converting enzyme
Type:n/a
Mol. Mass.:150405.15
Organism:Oryctolagus cuniculus
Description:n/a
Residue:1310
BDBM50084681
NameBDBM50084681
Synonyms:1-[2-(1-Ethoxycarbonyl-3-phenyl-propylamino)-propionyl]-octahydro-cyclopenta[b]pyrrole-2-carboxylic acid(Ramipril) CHEMBL1168 RAMIPRIL
TypeSmall organic molecule
Emp. Form.C23H32N2O5
Mol. Mass.416.5106
SMILESCCOC(=O)[C@H](CCc1ccccc1)N[C@@H](C)C(=O)N1[C@H]2CCC[C@H]2C[C@H]1C(O)=O