Reaction Details
TargetAmine oxidase [flavin-containing] A
LigandBDBM50093709
Substrate/Competitorn/a
Meas. Tech.ChEMBL_1501477 (CHEMBL3586839)
IC50 51.0±n/a nM
Citation Khattab, SNHaiba, NSAsal, AMBekhit, AAAmer, AAbdel-Rahman, HMEl-Faham, A Synthesis and evaluation of quinazoline amino acid derivatives as mono amine oxidase (MAO) inhibitors. Bioorg Med Chem23:3574-85 (2015) 
 
Amine oxidase [flavin-containing] A
Name:Amine oxidase [flavin-containing] A
Type:PROTEIN
Mol. Mass.:59764.63
Organism:Bos taurus
Description:ChEMBL_1501477
Residue:527
BDBM50093709
NameBDBM50093709
Synonyms:CHEMBL3585840
TypeSmall organic molecule
Emp. Form.C17H17ClN4O2
Mol. Mass.344.795
SMILESNNC(=O)CCN1C(Nc2ccccc2C1=O)c1ccc(Cl)cc1