Reaction Details
TargetAmine oxidase [flavin-containing] B
LigandBDBM50093710
Substrate/Competitorn/a
Meas. Tech.ChEMBL_1501478 (CHEMBL3586840)
IC50 380000±n/a nM
Citation Khattab, SNHaiba, NSAsal, AMBekhit, AAAmer, AAbdel-Rahman, HMEl-Faham, A Synthesis and evaluation of quinazoline amino acid derivatives as mono amine oxidase (MAO) inhibitors. Bioorg Med Chem23:3574-85 (2015) 
 
Amine oxidase [flavin-containing] B
Name:Amine oxidase [flavin-containing] B
Type:PROTEIN
Mol. Mass.:58428.94
Organism:Bos taurus
Description:ChEMBL_1501478
Residue:520
BDBM50093710
NameBDBM50093710
Synonyms:CHEMBL3585839
TypeSmall organic molecule
Emp. Form.C18H18N4O4
Mol. Mass.354.3599
SMILESNNC(=O)CCN1C(Nc2ccccc2C1=O)c1ccc2OCOc2c1