Reaction Details
TargetAmine oxidase [flavin-containing] B
LigandBDBM50093709
Substrate/Competitorn/a
Meas. Tech.ChEMBL_1501478 (CHEMBL3586840)
IC50 420000±n/a nM
Citation Khattab, SNHaiba, NSAsal, AMBekhit, AAAmer, AAbdel-Rahman, HMEl-Faham, A Synthesis and evaluation of quinazoline amino acid derivatives as mono amine oxidase (MAO) inhibitors. Bioorg Med Chem23:3574-85 (2015) 
 
Amine oxidase [flavin-containing] B
Name:Amine oxidase [flavin-containing] B
Type:PROTEIN
Mol. Mass.:58428.94
Organism:Bos taurus
Description:ChEMBL_1501478
Residue:520
BDBM50093709
NameBDBM50093709
Synonyms:CHEMBL3585840
TypeSmall organic molecule
Emp. Form.C17H17ClN4O2
Mol. Mass.344.795
SMILESNNC(=O)CCN1C(Nc2ccccc2C1=O)c1ccc(Cl)cc1