Reaction Details
TargetOrexin receptor type 2
LigandBDBM50093792
Substrate/Competitorn/a
Meas. Tech.ChEMBL_1502023 (CHEMBL3588582)
Ki 8.0±n/a nM
Citation Yoshida, YNaoe, YTerauchi, TOzaki, FDoko, TTakemura, ATanaka, TSorimachi, KBeuckmann, CTSuzuki, MUeno, TOzaki, SYonaga, M Discovery of (1R,2S)-2-{[(2,4-Dimethylpyrimidin-5-yl)oxy]methyl}-2-(3-fluorophenyl)-N-(5-fluoropyridin-2-yl)cyclopropanecarboxamide (E2006): A Potent and Efficacious Oral Orexin Receptor Antagonist. J Med Chem58:4648-64 (2015) 
 
Orexin receptor type 2
Name:Orexin receptor type 2
Type:Protein
Mol. Mass.:50710.53
Organism:Homo sapiens (Human)
Description:O43614
Residue:444
BDBM50093792
NameBDBM50093792
Synonyms:CHEMBL3585954
TypeSmall organic molecule
Emp. Form.C22H20F2N4O2
Mol. Mass.410.4166
SMILESCc1ncc(OC[C@]2(C[C@H]2C(=O)Nc2ccc(F)cn2)c2ccc(F)cc2)c(C)n1