Reaction Details
TargetOrexin receptor type 2
LigandBDBM50093900
Substrate/Competitorn/a
Meas. Tech.ChEMBL_1502023 (CHEMBL3588582)
Ki 7.0±n/a nM
Citation Yoshida, YNaoe, YTerauchi, TOzaki, FDoko, TTakemura, ATanaka, TSorimachi, KBeuckmann, CTSuzuki, MUeno, TOzaki, SYonaga, M Discovery of (1R,2S)-2-{[(2,4-Dimethylpyrimidin-5-yl)oxy]methyl}-2-(3-fluorophenyl)-N-(5-fluoropyridin-2-yl)cyclopropanecarboxamide (E2006): A Potent and Efficacious Oral Orexin Receptor Antagonist. J Med Chem58:4648-64 (2015) 
 
Orexin receptor type 2
Name:Orexin receptor type 2
Type:Protein
Mol. Mass.:50710.53
Organism:Homo sapiens (Human)
Description:O43614
Residue:444
BDBM50093900
NameBDBM50093900
Synonyms:CHEMBL3585946
TypeSmall organic molecule
Emp. Form.C22H21FN4O2
Mol. Mass.392.4261
SMILESCc1ncc(OC[C@]2(C[C@H]2C(=O)Nc2ccc(F)cn2)c2ccccc2)c(C)n1